{"text_format":"1","workbook":"xlsx","n_sheets":4,"sheets":["Company Information","Sustainability Information","Results ","Supplier Code of Conduct"],"not_rendered":{"charts":0,"images":1,"macros":1,"external_links":0,"defined_names":1,"comments":0,"pivot_tables":0},"unopened":[],"bounds":{"document_bytes":16777216,"sheet_cells":100000,"rows_first":2000,"rows_last":500,"rows_between":2000,"halvings":0,"cell_chars":16384,"cell_head_chars":4096},"cells_cut":0,"cells_raw":0,"read":"whole","date_system":"1900"}

{"sheet":"Company Information","index":0,"n_rows":64,"n_cols":4,"rows_kept":64,"cut":false,"hidden":false,"merged":[[0,1,0,2],[1,0,1,2],[12,1,12,2],[3,1,3,2],[4,1,4,2],[5,1,5,2],[6,1,6,2],[7,1,7,2],[8,1,8,2],[38,1,38,2],[30,1,30,2],[31,1,31,2],[32,1,32,2],[33,1,33,2],[36,1,36,2],[37,1,37,2],[29,1,29,2],[13,1,13,2],[14,1,14,2],[17,1,17,2],[18,1,18,2],[19,1,19,2],[22,1,22,2],[23,1,23,2],[24,1,24,2],[27,1,27,2],[28,1,28,2]]}
[{"$error":"#VALUE!"},"QF 22 - Supplier Setup & Evaluation Form"]
[]
["General Information"]
["Company Name",null,null,"*"]
["Registered Company Address",null,null,"*"]
["Company Registration Number",null,null,"*"]
["VAT Number",null,null,"*"]
["Payment Terms (OBW's standard terms are 30 days EOM)",null,null,"*"]
["Currency"]
[]
{"$rows_left_out":55}
{"sheet":"Sustainability Information","index":1,"n_rows":340,"n_cols":11,"rows_kept":340,"cut":false,"hidden":false,"merged":[[327,3,327,7],[311,3,311,7],[307,3,307,7],[267,3,267,7],[202,3,202,7],[216,2,216,7],[273,2,273,7],[274,2,274,7],[3,2,3,7],[4,2,4,7],[106,2,106,7],[107,2,107,7],[168,2,168,7],[160,3,160,7],[152,3,152,7],[144,3,144,7],[68,2,68,4],[113,2,113,4],[114,2,114,4],[115,2,115,4],[9,2,9,4],[10,2,10,4],[11,2,11,4],[66,2,66,4],[169,2,169,7],[194,3,194,7],[186,3,186,7],[215,2,215,7],[289,2,289,3],[258,6,258,7],[255,6,255,7],[256,6,256,7],[257,6,257,7],[44,2,44,7],[67,2,67,4],[47,2,47,3],[47,4,47,5],[47,6,47,7],[64,5,64,6],[45,2,45,7],[172,1,175,1],[282,2,282,4],[284,2,284,4],[294,2,294,4],[290,2,290,4],[292,2,292,4],[255,2,255,3],[210,1,210,3],[255,4,255,5],[256,4,256,5],[256,2,256,3],[257,2,257,3],[258,2,258,3],[257,4,257,5],[258,4,258,5]]}
["1","Quality Management"]
[]
[1.1000000000000001,"Does your company have a certified quality management system that is regularly audited  by an accredited body?* If so, please attach copy of Certificate.",null,false]
[null,null,"Click Check BOX If \"Yes\" & please continue to question 1.2",null,null,null,null,null,false]
[null,null,"Leave it unchecked If \"No\" & Please continue to questions 1.2 to 1.9"]
[1.2,"Is there an appointed person responsible for ensuring quality-related aspects & requirements in the company?*"]
[null,"Yes",false]
[null,"No",false]
[]
[null,"Name:"]
{"$rows_left_out":331}
{"sheet":"Results ","index":2,"n_rows":12,"n_cols":3,"rows_kept":12,"cut":false,"hidden":false,"merged":[]}
[null,null,"Result"]
[1,"Quality Management",{"$f":"IF('Sustainability Information'!D3, 100%, ('Sustainability Information'!C7+'Sustainability Information'!C15+'Sustainability Information'!C19+'Sustainability Information'!C23+'Sustainability Information'!C27+'Sustainability Information'!C31+'Sustainability Information'!C35+'Sustainability Information'!C39)/8)","v":0}]
[2,"Health & Safety",{"$f":"IF('Sustainability Information'!$E$44, 100%, ('Sustainability Information'!C60+'Sustainability Information'!C64+'Sustainability Information'!C72+'Sustainability Information'!C76+'Sustainability Information'!C80+'Sustainability Information'!C84+'Sustainability Information'!C88+'Sustainability Information'!C92+'Sustainability Information'!C96+'Sustainability Information'!C100)/10)","v":0}]
[3,"Energy Management",{"$f":"IF('Sustainability Information'!D106, 100%, ('Sustainability Information'!C111+'Sustainability Information'!C119+'Sustainability Information'!C123+'Sustainability Information'!C127+'Sustainability Information'!C131)/5)","v":0}]
[4,"Human and Labour Rights",{"$f":"('Sustainability Information'!C137+'Sustainability Information'!C141+'Sustainability Information'!C145+'Sustainability Information'!C149+'Sustainability Information'!C153+'Sustainability Information'!C157+'Sustainability Information'!C161+'Sustainability Information'!C165)/8","v":0}]
[5,"Ethics & Compliance",{"$f":"('Sustainability Information'!C187+'Sustainability Information'!C191+'Sustainability Information'!C195+'Sustainability Information'!C199+'Sustainability Information'!C203+'Sustainability Information'!C207)/6","v":0}]
[6,"Data Protection and Information Security",{"$f":"IF('Sustainability Information'!D215,100%,('Sustainability Information'!C220+'Sustainability Information'!C224+'Sustainability Information'!C228+'Sustainability Information'!C232+'Sustainability Information'!C236+'Sustainability Information'!C240+'Sustainability Information'!C244)/7)","v":0}]
[7,"Sustainable Management",{"$f":"(('Sustainability Information'!C264+'Sustainability Information'!C268)/2)","v":0}]
[8,"Carbon Footprint",{"$f":"IF('Sustainability Information'!D273, 100%)+IF('Sustainability Information'!C302,100%)","v":0}]
[9,"Social Sustainability Aspects",{"$f":"(('Sustainability Information'!C308+'Sustainability Information'!C312+'Sustainability Information'!C316+'Sustainability Information'!C320+'Sustainability Information'!C324+'Sustainability Information'!C328)/6)","v":0}]
{"$rows_left_out":3}
{"sheet":"Supplier Code of Conduct","index":3,"n_rows":82,"n_cols":1,"rows_kept":82,"cut":false,"hidden":false,"merged":[[81,0,83,13],[75,16338,75,16351],[75,16352,75,16365],[75,16366,75,16379],[75,16380,75,16383],[77,0,79,13],[75,16254,75,16267],[75,16268,75,16281],[75,16282,75,16295],[75,16296,75,16309],[75,16310,75,16323],[75,16324,75,16337],[75,16170,75,16183],[75,16184,75,16197],[75,16198,75,16211],[75,16212,75,16225],[75,16226,75,16239],[75,16240,75,16253],[75,16086,75,16099],[75,16100,75,16113],[75,16114,75,16127],[75,16128,75,16141],[75,16142,75,16155],[75,16156,75,16169],[75,16002,75,16015],[75,16016,75,16029],[75,16030,75,16043],[75,16044,75,16057],[75,16058,75,16071],[75,16072,75,16085],[75,15918,75,15931],[75,15932,75,15945],[75,15946,75,15959],[75,15960,75,15973],[75,15974,75,15987],[75,15988,75,16001],[75,15834,75,15847],[75,15848,75,15861],[75,15862,75,15875],[75,15876,75,15889],[75,15890,75,15903],[75,15904,75,15917],[75,15750,75,15763],[75,15764,75,15777],[75,15778,75,15791],[75,15792,75,15805],[75,15806,75,15819],[75,15820,75,15833],[75,15666,75,15679],[75,15680,75,15693],[75,15694,75,15707],[75,15708,75,15721],[75,15722,75,15735],[75,15736,75,15749],[75,15582,75,15595],[75,15596,75,15609],[75,15610,75,15623],[75,15624,75,15637],[75,15638,75,15651],[75,15652,75,15665],[75,15498,75,15511],[75,15512,75,15525],[75,15526,75,15539],[75,15540,75,15553],[75,15554,75,15567],[75,15568,75,15581],[75,15414,75,15427],[75,15428,75,15441],[75,15442,75,15455],[75,15456,75,15469],[75,15470,75,15483],[75,15484,75,15497],[75,15330,75,15343],[75,15344,75,15357],[75,15358,75,15371],[75,15372,75,15385],[75,15386,75,15399],[75,15400,75,15413],[75,15246,75,15259],[75,15260,75,15273],[75,15274,75,15287],[75,15288,75,15301],[75,15302,75,15315],[75,15316,75,15329],[75,15162,75,15175],[75,15176,75,15189],[75,15190,75,15203],[75,15204,75,15217],[75,15218,75,15231],[75,15232,75,15245],[75,15078,75,15091],[75,15092,75,15105],[75,15106,75,15119],[75,15120,75,15133],[75,15134,75,15147],[75,15148,75,15161],[75,14994,75,15007],[75,15008,75,15021],[75,15022,75,15035],[75,15036,75,15049],[75,15050,75,15063],[75,15064,75,15077],[75,14910,75,14923],[75,14924,75,14937],[75,14938,75,14951],[75,14952,75,14965],[75,14966,75,14979],[75,14980,75,14993],[75,14826,75,14839],[75,14840,75,14853],[75,14854,75,14867],[75,14868,75,14881],[75,14882,75,14895],[75,14896,75,14909],[75,14742,75,14755],[75,14756,75,14769],[75,14770,75,14783],[75,14784,75,14797],[75,14798,75,14811],[75,14812,75,14825],[75,14658,75,14671],[75,14672,75,14685],[75,14686,75,14699],[75,14700,75,14713],[75,14714,75,14727],[75,14728,75,14741],[75,14574,75,14587],[75,14588,75,14601],[75,14602,75,14615],[75,14616,75,14629],[75,14630,75,14643],[75,14644,75,14657],[75,14490,75,14503],[75,14504,75,14517],[75,14518,75,14531],[75,14532,75,14545],[75,14546,75,14559],[75,14560,75,14573],[75,14406,75,14419],[75,14420,75,14433],[75,14434,75,14447],[75,14448,75,14461],[75,14462,75,14475],[75,14476,75,14489],[75,14322,75,14335],[75,14336,75,14349],[75,14350,75,14363],[75,14364,75,14377],[75,14378,75,14391],[75,14392,75,14405],[75,14238,75,14251],[75,14252,75,14265],[75,14266,75,14279],[75,14280,75,14293],[75,14294,75,14307],[75,14308,75,14321],[75,14154,75,14167],[75,14168,75,14181],[75,14182,75,14195],[75,14196,75,14209],[75,14210,75,14223],[75,14224,75,14237],[75,14070,75,14083],[75,14084,75,14097],[75,14098,75,14111],[75,14112,75,14125],[75,14126,75,14139],[75,14140,75,14153],[75,13986,75,13999],[75,14000,75,14013],[75,14014,75,14027],[75,14028,75,14041],[75,14042,75,14055],[75,14056,75,14069],[75,13902,75,13915],[75,13916,75,13929],[75,13930,75,13943],[75,13944,75,13957],[75,13958,75,13971],[75,13972,75,13985],[75,13818,75,13831],[75,13832,75,13845],[75,13846,75,13859],[75,13860,75,13873],[75,13874,75,13887],[75,13888,75,13901],[75,13734,75,13747],[75,13748,75,13761],[75,13762,75,13775],[75,13776,75,13789],[75,13790,75,13803],[75,13804,75,13817],[75,13650,75,13663],[75,13664,75,13677],[75,13678,75,13691],[75,13692,75,13705],[75,13706,75,13719],[75,13720,75,13733],[75,13566,75,13579],[75,13580,75,13593],[75,13594,75,13607],[75,13608,75,13621],[75,13622,75,13635],[75,13636,75,13649],[75,13482,75,13495],[75,13496,75,13509],[75,13510,75,13523],[75,13524,75,13537],[75,13538,75,13551],[75,13552,75,13565],[75,13398,75,13411],[75,13412,75,13425],[75,13426,75,13439],[75,13440,75,13453],[75,13454,75,13467],[75,13468,75,13481],[75,13314,75,13327],[75,13328,75,13341],[75,13342,75,13355],[75,13356,75,13369],[75,13370,75,13383],[75,13384,75,13397],[75,13230,75,13243],[75,13244,75,13257],[75,13258,75,13271],[75,13272,75,13285],[75,13286,75,13299],[75,13300,75,13313],[75,13146,75,13159],[75,13160,75,13173],[75,13174,75,13187],[75,13188,75,13201],[75,13202,75,13215],[75,13216,75,13229],[75,13062,75,13075],[75,13076,75,13089],[75,13090,75,13103],[75,13104,75,13117],[75,13118,75,13131],[75,13132,75,13145],[75,12978,75,12991],[75,12992,75,13005],[75,13006,75,13019],[75,13020,75,13033],[75,13034,75,13047],[75,13048,75,13061],[75,12894,75,12907],[75,12908,75,12921],[75,12922,75,12935],[75,12936,75,12949],[75,12950,75,12963],[75,12964,75,12977],[75,12810,75,12823],[75,12824,75,12837],[75,12838,75,12851],[75,12852,75,12865],[75,12866,75,12879],[75,12880,75,12893],[75,12726,75,12739],[75,12740,75,12753],[75,12754,75,12767],[75,12768,75,12781],[75,12782,75,12795],[75,12796,75,12809],[75,12642,75,12655],[75,12656,75,12669],[75,12670,75,12683],[75,12684,75,12697],[75,12698,75,12711],[75,12712,75,12725],[75,12558,75,12571],[75,12572,75,12585],[75,12586,75,12599],[75,12600,75,12613],[75,12614,75,12627],[75,12628,75,12641],[75,12474,75,12487],[75,12488,75,12501],[75,12502,75,12515],[75,12516,75,12529],[75,12530,75,12543],[75,12544,75,12557],[75,12390,75,12403],[75,12404,75,12417],[75,12418,75,12431],[75,12432,75,12445],[75,12446,75,12459],[75,12460,75,12473],[75,12306,75,12319],[75,12320,75,12333],[75,12334,75,12347],[75,12348,75,12361],[75,12362,75,12375],[75,12376,75,12389],[75,12222,75,12235],[75,12236,75,12249],[75,12250,75,12263],[75,12264,75,12277],[75,12278,75,12291],[75,12292,75,12305],[75,12138,75,12151],[75,12152,75,12165],[75,12166,75,12179],[75,12180,75,12193],[75,12194,75,12207],[75,12208,75,12221],[75,12054,75,12067],[75,12068,75,12081],[75,12082,75,12095],[75,12096,75,12109],[75,12110,75,12123],[75,12124,75,12137],[75,11970,75,11983],[75,11984,75,11997],[75,11998,75,12011],[75,12012,75,12025],[75,12026,75,12039],[75,12040,75,12053],[75,11886,75,11899],[75,11900,75,11913],[75,11914,75,11927],[75,11928,75,11941],[75,11942,75,11955],[75,11956,75,11969],[75,11802,75,11815],[75,11816,75,11829],[75,11830,75,11843],[75,11844,75,11857],[75,11858,75,11871],[75,11872,75,11885],[75,11718,75,11731],[75,11732,75,11745],[75,11746,75,11759],[75,11760,75,11773],[75,11774,75,11787],[75,11788,75,11801],[75,11634,75,11647],[75,11648,75,11661],[75,11662,75,11675],[75,11676,75,11689],[75,11690,75,11703],[75,11704,75,11717],[75,11550,75,11563],[75,11564,75,11577],[75,11578,75,11591],[75,11592,75,11605],[75,11606,75,11619],[75,11620,75,11633],[75,11466,75,11479],[75,11480,75,11493],[75,11494,75,11507],[75,11508,75,11521],[75,11522,75,11535],[75,11536,75,11549],[75,11382,75,11395],[75,11396,75,11409],[75,11410,75,11423],[75,11424,75,11437],[75,11438,75,11451],[75,11452,75,11465],[75,11298,75,11311],[75,11312,75,11325],[75,11326,75,11339],[75,11340,75,11353],[75,11354,75,11367],[75,11368,75,11381],[75,11214,75,11227],[75,11228,75,11241],[75,11242,75,11255],[75,11256,75,11269],[75,11270,75,11283],[75,11284,75,11297],[75,11130,75,11143],[75,11144,75,11157],[75,11158,75,11171],[75,11172,75,11185],[75,11186,75,11199],[75,11200,75,11213],[75,11046,75,11059],[75,11060,75,11073],[75,11074,75,11087],[75,11088,75,11101],[75,11102,75,11115],[75,11116,75,11129],[75,10962,75,10975],[75,10976,75,10989],[75,10990,75,11003],[75,11004,75,11017],[75,11018,75,11031],[75,11032,75,11045],[75,10878,75,10891],[75,10892,75,10905],[75,10906,75,10919],[75,10920,75,10933],[75,10934,75,10947],[75,10948,75,10961],[75,10794,75,10807],[75,10808,75,10821],[75,10822,75,10835],[75,10836,75,10849],[75,10850,75,10863],[75,10864,75,10877],[75,10710,75,10723],[75,10724,75,10737],[75,10738,75,10751],[75,10752,75,10765],[75,10766,75,10779],[75,10780,75,10793],[75,10626,75,10639],[75,10640,75,10653],[75,10654,75,10667],[75,10668,75,10681],[75,10682,75,10695],[75,10696,75,10709],[75,10542,75,10555],[75,10556,75,10569],[75,10570,75,10583],[75,10584,75,10597],[75,10598,75,10611],[75,10612,75,10625],[75,10458,75,10471],[75,10472,75,10485],[75,10486,75,10499],[75,10500,75,10513],[75,10514,75,10527],[75,10528,75,10541],[75,10374,75,10387],[75,10388,75,10401],[75,10402,75,10415],[75,10416,75,10429],[75,10430,75,10443],[75,10444,75,10457],[75,10290,75,10303],[75,10304,75,10317],[75,10318,75,10331],[75,10332,75,10345],[75,10346,75,10359],[75,10360,75,10373],[75,10206,75,10219],[75,10220,75,10233],[75,10234,75,10247],[75,10248,75,10261],[75,10262,75,10275],[75,10276,75,10289],[75,10122,75,10135],[75,10136,75,10149],[75,10150,75,10163],[75,10164,75,10177],[75,10178,75,10191],[75,10192,75,10205],[75,10038,75,10051],[75,10052,75,10065],[75,10066,75,10079],[75,10080,75,10093],[75,10094,75,10107],[75,10108,75,10121],[75,9954,75,9967],[75,9968,75,9981],[75,9982,75,9995],[75,9996,75,10009],[75,10010,75,10023],[75,10024,75,10037],[75,9870,75,9883],[75,9884,75,9897],[75,9898,75,9911],[75,9912,75,9925],[75,9926,75,9939],[75,9940,75,9953],[75,9786,75,9799],[75,9800,75,9813],[75,9814,75,9827],[75,9828,75,9841],[75,9842,75,9855],[75,9856,75,9869],[75,9702,75,9715],[75,9716,75,9729],[75,9730,75,9743],[75,9744,75,9757],[75,9758,75,9771],[75,9772,75,9785],[75,9618,75,9631],[75,9632,75,9645],[75,9646,75,9659],[75,9660,75,9673],[75,9674,75,9687],[75,9688,75,9701],[75,9534,75,9547],[75,9548,75,9561],[75,9562,75,9575],[75,9576,75,9589],[75,9590,75,9603],[75,9604,75,9617],[75,9450,75,9463],[75,9464,75,9477],[75,9478,75,9491],[75,9492,75,9505],[75,9506,75,9519],[75,9520,75,9533],[75,9366,75,9379],[75,9380,75,9393],[75,9394,75,9407],[75,9408,75,9421],[75,9422,75,9435],[75,9436,75,9449],[75,9282,75,9295],[75,9296,75,9309],[75,9310,75,9323],[75,9324,75,9337],[75,9338,75,9351],[75,9352,75,9365],[75,9198,75,9211],[75,9212,75,9225],[75,9226,75,9239],[75,9240,75,9253],[75,9254,75,9267],[75,9268,75,9281],[75,9114,75,9127],[75,9128,75,9141],[75,9142,75,9155],[75,9156,75,9169],[75,9170,75,9183],[75,9184,75,9197],[75,9030,75,9043],[75,9044,75,9057],[75,9058,75,9071],[75,9072,75,9085],[75,9086,75,9099],[75,9100,75,9113],[75,8946,75,8959],[75,8960,75,8973],[75,8974,75,8987],[75,8988,75,9001],[75,9002,75,9015],[75,9016,75,9029],[75,8862,75,8875],[75,8876,75,8889],[75,8890,75,8903],[75,8904,75,8917],[75,8918,75,8931],[75,8932,75,8945],[75,8778,75,8791],[75,8792,75,8805],[75,8806,75,8819],[75,8820,75,8833],[75,8834,75,8847],[75,8848,75,8861],[75,8694,75,8707],[75,8708,75,8721],[75,8722,75,8735],[75,8736,75,8749],[75,8750,75,8763],[75,8764,75,8777],[75,8610,75,8623],[75,8624,75,8637],[75,8638,75,8651],[75,8652,75,8665],[75,8666,75,8679],[75,8680,75,8693],[75,8526,75,8539],[75,8540,75,8553],[75,8554,75,8567],[75,8568,75,8581],[75,8582,75,8595],[75,8596,75,8609],[75,8442,75,8455],[75,8456,75,8469],[75,8470,75,8483],[75,8484,75,8497],[75,8498,75,8511],[75,8512,75,8525],[75,8358,75,8371],[75,8372,75,8385],[75,8386,75,8399],[75,8400,75,8413],[75,8414,75,8427],[75,8428,75,8441],[75,8274,75,8287],[75,8288,75,8301],[75,8302,75,8315],[75,8316,75,8329],[75,8330,75,8343],[75,8344,75,8357],[75,8190,75,8203],[75,8204,75,8217],[75,8218,75,8231],[75,8232,75,8245],[75,8246,75,8259],[75,8260,75,8273],[75,8106,75,8119],[75,8120,75,8133],[75,8134,75,8147],[75,8148,75,8161],[75,8162,75,8175],[75,8176,75,8189],[75,8022,75,8035],[75,8036,75,8049],[75,8050,75,8063],[75,8064,75,8077],[75,8078,75,8091],[75,8092,75,8105],[75,7938,75,7951],[75,7952,75,7965],[75,7966,75,7979],[75,7980,75,7993],[75,7994,75,8007],[75,8008,75,8021],[75,7854,75,7867],[75,7868,75,7881],[75,7882,75,7895],[75,7896,75,7909],[75,7910,75,7923],[75,7924,75,7937],[75,7770,75,7783],[75,7784,75,7797],[75,7798,75,7811],[75,7812,75,7825],[75,7826,75,7839],[75,7840,75,7853],[75,7686,75,7699],[75,7700,75,7713],[75,7714,75,7727],[75,7728,75,7741],[75,7742,75,7755],[75,7756,75,7769],[75,7602,75,7615],[75,7616,75,7629],[75,7630,75,7643],[75,7644,75,7657],[75,7658,75,7671],[75,7672,75,7685],[75,7518,75,7531],[75,7532,75,7545],[75,7546,75,7559],[75,7560,75,7573],[75,7574,75,7587],[75,7588,75,7601],[75,7434,75,7447],[75,7448,75,7461],[75,7462,75,7475],[75,7476,75,7489],[75,7490,75,7503],[75,7504,75,7517],[75,7350,75,7363],[75,7364,75,7377],[75,7378,75,7391],[75,7392,75,7405],[75,7406,75,7419],[75,7420,75,7433],[75,7266,75,7279],[75,7280,75,7293],[75,7294,75,7307],[75,7308,75,7321],[75,7322,75,7335],[75,7336,75,7349],[75,7182,75,7195],[75,7196,75,7209],[75,7210,75,7223],[75,7224,75,7237],[75,7238,75,7251],[75,7252,75,7265],[75,7098,75,7111],[75,7112,75,7125],[75,7126,75,7139],[75,7140,75,7153],[75,7154,75,7167],[75,7168,75,7181],[75,7014,75,7027],[75,7028,75,7041],[75,7042,75,7055],[75,7056,75,7069],[75,7070,75,7083],[75,7084,75,7097],[75,6930,75,6943],[75,6944,75,6957],[75,6958,75,6971],[75,6972,75,6985],[75,6986,75,6999],[75,7000,75,7013],[75,6846,75,6859],[75,6860,75,6873],[75,6874,75,6887],[75,6888,75,6901],[75,6902,75,6915],[75,6916,75,6929],[75,6762,75,6775],[75,6776,75,6789],[75,6790,75,6803],[75,6804,75,6817],[75,6818,75,6831],[75,6832,75,6845],[75,6678,75,6691],[75,6692,75,6705],[75,6706,75,6719],[75,6720,75,6733],[75,6734,75,6747],[75,6748,75,6761],[75,6594,75,6607],[75,6608,75,6621],[75,6622,75,6635],[75,6636,75,6649],[75,6650,75,6663],[75,6664,75,6677],[75,6510,75,6523],[75,6524,75,6537],[75,6538,75,6551],[75,6552,75,6565],[75,6566,75,6579],[75,6580,75,6593],[75,6426,75,6439],[75,6440,75,6453],[75,6454,75,6467],[75,6468,75,6481],[75,6482,75,6495],[75,6496,75,6509],[75,6342,75,6355],[75,6356,75,6369],[75,6370,75,6383],[75,6384,75,6397],[75,6398,75,6411],[75,6412,75,6425],[75,6258,75,6271],[75,6272,75,6285],[75,6286,75,6299],[75,6300,75,6313],[75,6314,75,6327],[75,6328,75,6341],[75,6174,75,6187],[75,6188,75,6201],[75,6202,75,6215],[75,6216,75,6229],[75,6230,75,6243],[75,6244,75,6257],[75,6090,75,6103],[75,6104,75,6117],[75,6118,75,6131],[75,6132,75,6145],[75,6146,75,6159],[75,6160,75,6173],[75,6006,75,6019],[75,6020,75,6033],[75,6034,75,6047],[75,6048,75,6061],[75,6062,75,6075],[75,6076,75,6089],[75,5922,75,5935],[75,5936,75,5949],[75,5950,75,5963],[75,5964,75,5977],[75,5978,75,5991],[75,5992,75,6005],[75,5838,75,5851],[75,5852,75,5865],[75,5866,75,5879],[75,5880,75,5893],[75,5894,75,5907],[75,5908,75,5921],[75,5754,75,5767],[75,5768,75,5781],[75,5782,75,5795],[75,5796,75,5809],[75,5810,75,5823],[75,5824,75,5837],[75,5670,75,5683],[75,5684,75,5697],[75,5698,75,5711],[75,5712,75,5725],[75,5726,75,5739],[75,5740,75,5753],[75,5586,75,5599],[75,5600,75,5613],[75,5614,75,5627],[75,5628,75,5641],[75,5642,75,5655],[75,5656,75,5669],[75,5502,75,5515],[75,5516,75,5529],[75,5530,75,5543],[75,5544,75,5557],[75,5558,75,5571],[75,5572,75,5585],[75,5418,75,5431],[75,5432,75,5445],[75,5446,75,5459],[75,5460,75,5473],[75,5474,75,5487],[75,5488,75,5501],[75,5334,75,5347],[75,5348,75,5361],[75,5362,75,5375],[75,5376,75,5389],[75,5390,75,5403],[75,5404,75,5417],[75,5250,75,5263],[75,5264,75,5277],[75,5278,75,5291],[75,5292,75,5305],[75,5306,75,5319],[75,5320,75,5333],[75,5166,75,5179],[75,5180,75,5193],[75,5194,75,5207],[75,5208,75,5221],[75,5222,75,5235],[75,5236,75,5249],[75,5082,75,5095],[75,5096,75,5109],[75,5110,75,5123],[75,5124,75,5137],[75,5138,75,5151],[75,5152,75,5165],[75,4998,75,5011],[75,5012,75,5025],[75,5026,75,5039],[75,5040,75,5053],[75,5054,75,5067],[75,5068,75,5081],[75,4914,75,4927],[75,4928,75,4941],[75,4942,75,4955],[75,4956,75,4969],[75,4970,75,4983],[75,4984,75,4997],[75,4830,75,4843],[75,4844,75,4857],[75,4858,75,4871],[75,4872,75,4885],[75,4886,75,4899],[75,4900,75,4913],[75,4746,75,4759],[75,4760,75,4773],[75,4774,75,4787],[75,4788,75,4801],[75,4802,75,4815],[75,4816,75,4829],[75,4662,75,4675],[75,4676,75,4689],[75,4690,75,4703],[75,4704,75,4717],[75,4718,75,4731],[75,4732,75,4745],[75,4578,75,4591],[75,4592,75,4605],[75,4606,75,4619],[75,4620,75,4633],[75,4634,75,4647],[75,4648,75,4661],[75,4494,75,4507],[75,4508,75,4521],[75,4522,75,4535],[75,4536,75,4549],[75,4550,75,4563],[75,4564,75,4577],[75,4410,75,4423],[75,4424,75,4437],[75,4438,75,4451],[75,4452,75,4465],[75,4466,75,4479],[75,4480,75,4493],[75,4326,75,4339],[75,4340,75,4353],[75,4354,75,4367],[75,4368,75,4381],[75,4382,75,4395],[75,4396,75,4409],[75,4242,75,4255],[75,4256,75,4269],[75,4270,75,4283],[75,4284,75,4297],[75,4298,75,4311],[75,4312,75,4325],[75,4158,75,4171],[75,4172,75,4185],[75,4186,75,4199],[75,4200,75,4213],[75,4214,75,4227],[75,4228,75,4241],[75,4074,75,4087],[75,4088,75,4101],[75,4102,75,4115],[75,4116,75,4129],[75,4130,75,4143],[75,4144,75,4157],[75,3990,75,4003],[75,4004,75,4017],[75,4018,75,4031],[75,4032,75,4045],[75,4046,75,4059],[75,4060,75,4073],[75,3906,75,3919],[75,3920,75,3933],[75,3934,75,3947],[75,3948,75,3961],[75,3962,75,3975],[75,3976,75,3989],[75,3822,75,3835],[75,3836,75,3849],[75,3850,75,3863],[75,3864,75,3877],[75,3878,75,3891],[75,3892,75,3905],[75,3738,75,3751],[75,3752,75,3765],[75,3766,75,3779],[75,3780,75,3793],[75,3794,75,3807],[75,3808,75,3821],[75,3654,75,3667],[75,3668,75,3681],[75,3682,75,3695],[75,3696,75,3709],[75,3710,75,3723],[75,3724,75,3737],[75,3570,75,3583],[75,3584,75,3597],[75,3598,75,3611],[75,3612,75,3625],[75,3626,75,3639],[75,3640,75,3653],[75,3486,75,3499],[75,3500,75,3513],[75,3514,75,3527],[75,3528,75,3541],[75,3542,75,3555],[75,3556,75,3569],[75,3402,75,3415],[75,3416,75,3429],[75,3430,75,3443],[75,3444,75,3457],[75,3458,75,3471],[75,3472,75,3485],[75,3318,75,3331],[75,3332,75,3345],[75,3346,75,3359],[75,3360,75,3373],[75,3374,75,3387],[75,3388,75,3401],[75,3234,75,3247],[75,3248,75,3261],[75,3262,75,3275],[75,3276,75,3289],[75,3290,75,3303],[75,3304,75,3317],[75,3150,75,3163],[75,3164,75,3177],[75,3178,75,3191],[75,3192,75,3205],[75,3206,75,3219],[75,3220,75,3233],[75,3066,75,3079],[75,3080,75,3093],[75,3094,75,3107],[75,3108,75,3121],[75,3122,75,3135],[75,3136,75,3149],[75,2982,75,2995],[75,2996,75,3009],[75,3010,75,3023],[75,3024,75,3037],[75,3038,75,3051],[75,3052,75,3065],[75,2898,75,2911],[75,2912,75,2925],[75,2926,75,2939],[75,2940,75,2953],[75,2954,75,2967],[75,2968,75,2981],[75,2814,75,2827],[75,2828,75,2841],[75,2842,75,2855],[75,2856,75,2869],[75,2870,75,2883],[75,2884,75,2897],[75,2730,75,2743],[75,2744,75,2757],[75,2758,75,2771],[75,2772,75,2785],[75,2786,75,2799],[75,2800,75,2813],[75,2646,75,2659],[75,2660,75,2673],[75,2674,75,2687],[75,2688,75,2701],[75,2702,75,2715],[75,2716,75,2729],[75,2562,75,2575],[75,2576,75,2589],[75,2590,75,2603],[75,2604,75,2617],[75,2618,75,2631],[75,2632,75,2645],[75,2478,75,2491],[75,2492,75,2505],[75,2506,75,2519],[75,2520,75,2533],[75,2534,75,2547],[75,2548,75,2561],[75,2394,75,2407],[75,2408,75,2421],[75,2422,75,2435],[75,2436,75,2449]],"merged_total":19944,"flags":["merged_cut"]}
["OBW Technologies Supplier Code of Conduct"]
[]
["Introduction: As Ireland's leading provider of gas detection solutions, OBW Technologies is committed to upholding the highest standards of ethical, environmental, and social responsibility throughout our supply chain. This Supplier Code of Conduct outlines the principles and expectations we have for all our suppliers. By adhering to this Code, suppliers play a vital role in supporting OBW’s sustainability goals and aligning with the Corporate Sustainability Reporting Directive (CSRD) standards that we are adopting."]
[]
[]
[]
[]
[]
["Compliance with Laws and Regulations: Suppliers must comply with all applicable local, national, and international laws and regulations. This includes, but is not limited to, laws governing environmental protection, labour practices, and anti-corruption measures. Suppliers are expected to:"]
[]
{"$rows_left_out":72}